{"text_format":"1","workbook":"xlsx","n_sheets":20,"sheets":["Overview","Initial Settings","Market Inputs","Owner-Operator Inputs","Private Sector Partner Inputs","Public Sector Partner Inputs","Owner-Operator DCF","Private Sector Partner DCF","Public Sector Partner DCF","Combined DCF","Debt Schedule","Terminal Value Model","Outputs Dashboard","Income Statement","Balance Sheet","SCF","Report","Sensitivity Tables","Lists_Hidden","Version"],"not_rendered":{"charts":28,"images":1,"macros":1,"external_links":0,"defined_names":8834,"comments":0,"pivot_tables":0},"unopened":[],"bounds":{"document_bytes":16777216,"sheet_cells":100000,"rows_first":2000,"rows_last":500,"rows_between":2000,"halvings":0,"cell_chars":16384,"cell_head_chars":4096},"cells_cut":0,"cells_raw":0,"read":"whole","date_system":"1900"}

{"sheet":"Overview","index":0,"n_rows":0,"n_cols":0,"rows_kept":0,"cut":false,"hidden":false,"merged":[]}

{"sheet":"Initial Settings","index":1,"n_rows":26,"n_cols":9,"rows_kept":26,"cut":false,"hidden":false,"merged":[[5,2,5,4],[10,0,10,3],[12,0,12,3]]}
[{"$f":"C6","v":"Washington EV - Business Model 3 - Walla Walla"}]
[]
[]
["Initial Settings"]
[null,null,null,null,null,null,null," "]
["Scenario Name",null,"Washington EV - Business Model 3 - Walla Walla"]
{"$rows_left_out":21}
{"sheet":"Market Inputs","index":2,"n_rows":44,"n_cols":15,"rows_kept":44,"cut":false,"hidden":false,"merged":[]}
[{"$f":"'Initial Settings'!C6","v":"Washington EV - Business Model 3 - Walla Walla"}]
[]
[]
["Market Assumptions"]
[]
[null,null,null,null,null,{"$f":"+'Initial Settings'!$C$7+1","v":2016},{"$f":"F6+1","v":2017},{"$f":"G6+1","v":2018},2019,2020,2021,2022,2023,2024,2025]
{"$rows_left_out":39}
{"sheet":"Owner-Operator Inputs","index":3,"n_rows":299,"n_cols":15,"rows_kept":299,"cut":false,"hidden":false,"merged":[[9,4,9,5],[72,4,72,5],[135,4,135,5]]}
[{"$f":"'Initial Settings'!$C$6","v":"Washington EV - Business Model 3 - Walla Walla"}]
[]
[]
["Charging Station Assumptions"]
[]
["Expected equipment lifespan [years] - All equipment types",null,null,null,10]
{"$rows_left_out":294}
{"sheet":"Private Sector Partner Inputs","index":4,"n_rows":62,"n_cols":15,"rows_kept":62,"cut":false,"hidden":false,"merged":[]}
[{"$f":"'Initial Settings'!$C$6","v":"Washington EV - Business Model 3 - Walla Walla"}]
[]
[]
["Private Sector Partner(s) Inputs"]
[]
["Private Sector Weighted Average Cost of Capital (WACC)",null,null,null,0.1033]
{"$rows_left_out":57}
{"sheet":"Public Sector Partner Inputs","index":5,"n_rows":20,"n_cols":15,"rows_kept":20,"cut":false,"hidden":false,"merged":[[17,0,17,2]]}
[{"$f":"'Initial Settings'!$C$6","v":"Washington EV - Business Model 3 - Walla Walla"}]
[]
[]
["Public Sector Partner Inputs"]
[]
["Public Sector Cost of Capital [%]",null,null,null,5.3999999999999999E-2]
{"$rows_left_out":15}
{"sheet":"Owner-Operator DCF","index":6,"n_rows":28,"n_cols":13,"rows_kept":28,"cut":false,"hidden":false,"merged":[]}
[{"$f":"'Initial Settings'!$C$6","v":"Washington EV - Business Model 3 - Walla Walla"}]
[]
[]
["Owner/Operator Discounted Cash Flow Model",null,{"$f":"'Initial Settings'!$C$7","v":2015},{"$f":"'Owner-Operator Inputs'!F254","v":2016},{"$f":"'Owner-Operator Inputs'!G254","v":2017},{"$f":"'Owner-Operator Inputs'!H254","v":2018},{"$f":"'Owner-Operator Inputs'!I254","v":2019},{"$f":"'Owner-Operator Inputs'!J254","v":2020},{"$f":"'Owner-Operator Inputs'!K254","v":2021},{"$f":"'Owner-Operator Inputs'!L254","v":2022},{"$f":"'Owner-Operator Inputs'!M254","v":2023},{"$f":"'Owner-Operator Inputs'!N254","v":2024},{"$f":"'Owner-Operator Inputs'!O254","v":2025}]
[]
["Revenue",null,null,{"$f":"'Owner-Operator Inputs'!F216","v":291000},{"$f":"'Owner-Operator Inputs'!G216","v":239120},{"$f":"'Owner-Operator Inputs'!H216","v":291727.5},{"$f":"'Owner-Operator Inputs'!I216","v":355912.5},{"$f":"'Owner-Operator Inputs'!J216","v":434215},{"$f":"'Owner-Operator Inputs'!K216","v":529747.5},{"$f":"'Owner-Operator Inputs'!L216","v":592000},{"$f":"'Owner-Operator Inputs'!M216","v":592000},{"$f":"'Owner-Operator Inputs'!N216","v":592000},{"$f":"'Owner-Operator Inputs'!O216","v":592000}]
{"$rows_left_out":23}
{"sheet":"Private Sector Partner DCF","index":7,"n_rows":27,"n_cols":13,"rows_kept":27,"cut":false,"hidden":false,"merged":[]}
[{"$f":"'Initial Settings'!$C$6","v":"Washington EV - Business Model 3 - Walla Walla"}]
[]
[]
["Private Sector Discounted Cash Flow Model",null,{"$f":"'Initial Settings'!$C$7","v":2015},{"$f":"'Owner-Operator Inputs'!F254","v":2016},{"$f":"'Owner-Operator Inputs'!G254","v":2017},{"$f":"'Owner-Operator Inputs'!H254","v":2018},{"$f":"'Owner-Operator Inputs'!I254","v":2019},{"$f":"'Owner-Operator Inputs'!J254","v":2020},{"$f":"'Owner-Operator Inputs'!K254","v":2021},{"$f":"'Owner-Operator Inputs'!L254","v":2022},{"$f":"'Owner-Operator Inputs'!M254","v":2023},{"$f":"'Owner-Operator Inputs'!N254","v":2024},{"$f":"'Owner-Operator Inputs'!O254","v":2025}]
[]
["Revenue",null,null,{"$f":"'Private Sector Partner Inputs'!F49","v":658702.07576610183},{"$f":"'Private Sector Partner Inputs'!G49","v":781902.07576610183},{"$f":"'Private Sector Partner Inputs'!H49","v":932202.07576610183},{"$f":"'Private Sector Partner Inputs'!I49","v":1115577.0757661017},{"$f":"'Private Sector Partner Inputs'!J49","v":1339302.0757661017},{"$f":"'Private Sector Partner Inputs'!K49","v":1612252.0757661017},{"$f":"'Private Sector Partner Inputs'!L49","v":1781202.0757661017},{"$f":"'Private Sector Partner Inputs'!M49","v":1781202.0757661017},{"$f":"'Private Sector Partner Inputs'!N49","v":1781202.0757661017},{"$f":"'Private Sector Partner Inputs'!O49","v":1781202.0757661017}]
{"$rows_left_out":22}
{"sheet":"Public Sector Partner DCF","index":8,"n_rows":25,"n_cols":13,"rows_kept":25,"cut":false,"hidden":false,"merged":[]}
[{"$f":"'Initial Settings'!$C$6","v":"Washington EV - Business Model 3 - Walla Walla"}]
[]
[]
["Public Sector Discounted Cash Flow Model",null,{"$f":"'Initial Settings'!$C$7","v":2015},{"$f":"'Owner-Operator Inputs'!F254","v":2016},{"$f":"'Owner-Operator Inputs'!G254","v":2017},{"$f":"'Owner-Operator Inputs'!H254","v":2018},{"$f":"'Owner-Operator Inputs'!I254","v":2019},{"$f":"'Owner-Operator Inputs'!J254","v":2020},{"$f":"'Owner-Operator Inputs'!K254","v":2021},{"$f":"'Owner-Operator Inputs'!L254","v":2022},{"$f":"'Owner-Operator Inputs'!M254","v":2023},{"$f":"'Owner-Operator Inputs'!N254","v":2024},{"$f":"'Owner-Operator Inputs'!O254","v":2025}]
[]
["Cash Outflows"]
{"$rows_left_out":20}
{"sheet":"Combined DCF","index":9,"n_rows":17,"n_cols":13,"rows_kept":17,"cut":false,"hidden":false,"merged":[]}
[{"$f":"'Initial Settings'!$C$6","v":"Washington EV - Business Model 3 - Walla Walla"}]
[]
[]
["Combined Discounted Cash Flow Model",null,{"$f":"'Initial Settings'!$C$7","v":2015},{"$f":"'Owner-Operator Inputs'!F254","v":2016},{"$f":"'Owner-Operator Inputs'!G254","v":2017},{"$f":"'Owner-Operator Inputs'!H254","v":2018},{"$f":"'Owner-Operator Inputs'!I254","v":2019},{"$f":"'Owner-Operator Inputs'!J254","v":2020},{"$f":"'Owner-Operator Inputs'!K254","v":2021},{"$f":"'Owner-Operator Inputs'!L254","v":2022},{"$f":"'Owner-Operator Inputs'!M254","v":2023},{"$f":"'Owner-Operator Inputs'!N254","v":2024},{"$f":"'Owner-Operator Inputs'!O254","v":2025}]
[]
["Cash flow from owner operator",null,{"$f":"'Owner-Operator DCF'!C21","v":-316140.00000000029},{"$f":"'Owner-Operator DCF'!D21","v":106923.88567474004},{"$f":"'Owner-Operator DCF'!E21","v":33239.893986535433},{"$f":"'Owner-Operator DCF'!F21","v":71015.664089512429},{"$f":"'Owner-Operator DCF'!G21","v":105704.24455083048},{"$f":"'Owner-Operator DCF'!H21","v":148221.8646839062},{"$f":"'Owner-Operator DCF'!I21","v":200306.318843894},{"$f":"'Owner-Operator DCF'!J21","v":229032.47811261629},{"$f":"'Owner-Operator DCF'!K21","v":220746.33840412291},{"$f":"'Owner-Operator DCF'!L21","v":218552.14200571913},{"$f":"'Owner-Operator DCF'!M21","v":127415.06831356807}]
{"$rows_left_out":12}
{"sheet":"Debt Schedule","index":10,"n_rows":17,"n_cols":23,"rows_kept":17,"cut":false,"hidden":false,"merged":[]}
[{"$f":"'Initial Settings'!$C$6","v":"Washington EV - Business Model 3 - Walla Walla"}]
[]
[]
["Debt Schedule",null,"Year->",1,{"$f":"D4+1","v":2},3,4,5,6,7,8,9,10,11,12,13,14,15,16,17,18,19,20]
["Public Sector Debt",null,{"$f":"'Public Sector Partner Inputs'!$E$10","v":415230}]
["Annual Principal Payment",null,null,{"$f":"IF(D$4<='Public Sector Partner Inputs'!$E$11,PPMT('Public Sector Partner Inputs'!$E$12,D$4,'Public Sector Partner Inputs'!$E$11,'Public Sector Partner Inputs'!$E$10),0)","v":-32401.292107566733},{"$f":"IF(E$4<='Public Sector Partner Inputs'!$E$11,PPMT('Public Sector Partner Inputs'!$E$12,E$4,'Public Sector Partner Inputs'!$E$11,'Public Sector Partner Inputs'!$E$10),0)","v":-34150.96188137534},{"$f":"IF(F$4<='Public Sector Partner Inputs'!$E$11,PPMT('Public Sector Partner Inputs'!$E$12,F$4,'Public Sector Partner Inputs'!$E$11,'Public Sector Partner Inputs'!$E$10),0)","v":-35995.113822969608},{"$f":"IF(G$4<='Public Sector Partner Inputs'!$E$11,PPMT('Public Sector Partner Inputs'!$E$12,G$4,'Public Sector Partner Inputs'!$E$11,'Public Sector Partner Inputs'!$E$10),0)","v":-37938.849969409966},{"$f":"IF(H$4<='Public Sector Partner Inputs'!$E$11,PPMT('Public Sector Partner Inputs'!$E$12,H$4,'Public Sector Partner Inputs'!$E$11,'Public Sector Partner Inputs'!$E$10),0)","v":-39987.547867758098},{"$f":"IF(I$4<='Public Sector Partner Inputs'!$E$11,PPMT('Public Sector Partner Inputs'!$E$12,I$4,'Public Sector Partner Inputs'!$E$11,'Public Sector Partner Inputs'!$E$10),0)","v":-42146.875452617045},{"$f":"IF(J$4<='Public Sector Partner Inputs'!$E$11,PPMT('Public Sector Partner Inputs'!$E$12,J$4,'Public Sector Partner Inputs'!$E$11,'Public Sector Partner Inputs'!$E$10),0)","v":-44422.806727058363},{"$f":"IF(K$4<='Public Sector Partner Inputs'!$E$11,PPMT('Public Sector Partner Inputs'!$E$12,K$4,'Public Sector Partner Inputs'!$E$11,'Public Sector Partner Inputs'!$E$10),0)","v":-46821.638290319512},{"$f":"IF(L$4<='Public Sector Partner Inputs'!$E$11,PPMT('Public Sector Partner Inputs'!$E$12,L$4,'Public Sector Partner Inputs'!$E$11,'Public Sector Partner Inputs'!$E$10),0)","v":-49350.006757996765},{"$f":"IF(M$4<='Public Sector Partner Inputs'!$E$11,PPMT('Public Sector Partner Inputs'!$E$12,M$4,'Public Sector Partner Inputs'!$E$11,'Public Sector Partner Inputs'!$E$10),0)","v":-52014.907122928591},{"$f":"IF(N$4<='Public Sector Partner Inputs'!$E$11,PPMT('Public Sector Partner Inputs'!$E$12,N$4,'Public Sector Partner Inputs'!$E$11,'Public Sector Partner Inputs'!$E$10),0)","v":0},{"$f":"IF(O$4<='Public Sector Partner Inputs'!$E$11,PPMT('Public Sector Partner Inputs'!$E$12,O$4,'Public Sector Partner Inputs'!$E$11,'Public Sector Partner Inputs'!$E$10),0)","v":0},{"$f":"IF(P$4<='Public Sector Partner Inputs'!$E$11,PPMT('Public Sector Partner Inputs'!$E$12,P$4,'Public Sector Partner Inputs'!$E$11,'Public Sector Partner Inputs'!$E$10),0)","v":0},{"$f":"IF(Q$4<='Public Sector Partner Inputs'!$E$11,PPMT('Public Sector Partner Inputs'!$E$12,Q$4,'Public Sector Partner Inputs'!$E$11,'Public Sector Partner Inputs'!$E$10),0)","v":0},{"$f":"IF(R$4<='Public Sector Partner Inputs'!$E$11,PPMT('Public Sector Partner Inputs'!$E$12,R$4,'Public Sector Partner Inputs'!$E$11,'Public Sector Partner Inputs'!$E$10),0)","v":0},{"$f":"IF(S$4<='Public Sector Partner Inputs'!$E$11,PPMT('Public Sector Partner Inputs'!$E$12,S$4,'Public Sector Partner Inputs'!$E$11,'Public Sector Partner Inputs'!$E$10),0)","v":0},{"$f":"IF(T$4<='Public Sector Partner Inputs'!$E$11,PPMT('Public Sector Partner Inputs'!$E$12,T$4,'Public Sector Partner Inputs'!$E$11,'Public Sector Partner Inputs'!$E$10),0)","v":0},{"$f":"IF(U$4<='Public Sector Partner Inputs'!$E$11,PPMT('Public Sector Partner Inputs'!$E$12,U$4,'Public Sector Partner Inputs'!$E$11,'Public Sector Partner Inputs'!$E$10),0)","v":0},{"$f":"IF(V$4<='Public Sector Partner Inputs'!$E$11,PPMT('Public Sector Partner Inputs'!$E$12,V$4,'Public Sector Partner Inputs'!$E$11,'Public Sector Partner Inputs'!$E$10),0)","v":0},{"$f":"IF(W$4<='Public Sector Partner Inputs'!$E$11,PPMT('Public Sector Partner Inputs'!$E$12,W$4,'Public Sector Partner Inputs'!$E$11,'Public Sector Partner Inputs'!$E$10),0)","v":0}]
{"$rows_left_out":12}
{"sheet":"Terminal Value Model","index":11,"n_rows":16,"n_cols":13,"rows_kept":16,"cut":false,"hidden":false,"merged":[[11,0,11,1]]}
[{"$f":"'Initial Settings'!$C$6","v":"Washington EV - Business Model 3 - Walla Walla"}]
[]
[]
["Based on Assumed EBITDA Exit Multiple",null,{"$f":"'Initial Settings'!$C$7","v":2015},{"$f":"'Owner-Operator Inputs'!F254","v":2016},{"$f":"'Owner-Operator Inputs'!G254","v":2017},{"$f":"'Owner-Operator Inputs'!H254","v":2018},{"$f":"'Owner-Operator Inputs'!I254","v":2019},{"$f":"'Owner-Operator Inputs'!J254","v":2020},{"$f":"'Owner-Operator Inputs'!K254","v":2021},{"$f":"'Owner-Operator Inputs'!L254","v":2022},{"$f":"'Owner-Operator Inputs'!M254","v":2023},{"$f":"'Owner-Operator Inputs'!N254","v":2024},{"$f":"'Owner-Operator Inputs'!O254","v":2025}]
[]
["EBITDA",null,{"$f":"'Income Statement'!B23+'Income Statement'!B18","v":0},{"$f":"'Income Statement'!C23+'Income Statement'!C18","v":196466.40000000002},{"$f":"'Income Statement'!D23+'Income Statement'!D18","v":140670.9088},{"$f":"'Income Statement'!E23+'Income Statement'!E18","v":182686.36903440001},{"$f":"'Income Statement'!F23+'Income Statement'!F18","v":233924.13236155803},{"$f":"'Income Statement'!G23+'Income Statement'!G18","v":296401.98848301847},{"$f":"'Income Statement'!H23+'Income Statement'!H18","v":372591.39717186644},{"$f":"'Income Statement'!I23+'Income Statement'!I18","v":422142.19040831085},{"$f":"'Income Statement'!J23+'Income Statement'!J18","v":421918.54488433164},{"$f":"'Income Statement'!K23+'Income Statement'!K18","v":421694.34024654247},{"$f":"'Income Statement'!L23+'Income Statement'!L18","v":421469.5750971589}]
{"$rows_left_out":11}
{"sheet":"Outputs Dashboard","index":12,"n_rows":275,"n_cols":10,"rows_kept":275,"cut":false,"hidden":false,"merged":[[2,4,2,5],[2,1,2,2]]}
[{"$f":"'Initial Settings'!$C$6","v":"Washington EV - Business Model 3 - Walla Walla"}]
[]
[null,"Financial Performance Statistics",null,null,"Charging Infrastructure Statistics"]
[null,"Project",null,null,"Total New Sites"]
[null,"Total Capital Investment",{"$f":"'Owner-Operator Inputs'!E231","v":1384100},null,{"$f":"'Owner-Operator Inputs'!E22+'Owner-Operator Inputs'!E85+'Owner-Operator Inputs'!E148","v":20}]
[null,"Total Net Present Value",{"$f":"'Combined DCF'!B15","v":862639.68969753932},null,"Total New Stations"]
{"$rows_left_out":270}
{"sheet":"Income Statement","index":13,"n_rows":34,"n_cols":12,"rows_kept":34,"cut":false,"hidden":false,"merged":[]}
[{"$f":"'Initial Settings'!$C$6","v":"Washington EV - Business Model 3 - Walla Walla"}]
[]
["Consolidated Statements of Income [$]"]
[]
[null,{"$f":"'Initial Settings'!C7","v":2015},{"$f":"'Owner-Operator Inputs'!F254","v":2016},{"$f":"'Owner-Operator Inputs'!G254","v":2017},{"$f":"'Owner-Operator Inputs'!H254","v":2018},{"$f":"'Owner-Operator Inputs'!I254","v":2019},{"$f":"'Owner-Operator Inputs'!J254","v":2020},{"$f":"'Owner-Operator Inputs'!K254","v":2021},{"$f":"'Owner-Operator Inputs'!L254","v":2022},{"$f":"'Owner-Operator Inputs'!M254","v":2023},{"$f":"'Owner-Operator Inputs'!N254","v":2024},{"$f":"'Owner-Operator Inputs'!O254","v":2025}]
["Revenues"]
{"$rows_left_out":29}
{"sheet":"Balance Sheet","index":14,"n_rows":39,"n_cols":12,"rows_kept":39,"cut":false,"hidden":false,"merged":[]}
[{"$f":"'Initial Settings'!C6","v":"Washington EV - Business Model 3 - Walla Walla"}]
[]
["Consolidated Balance Sheet [$]"]
[]
["Assets",{"$f":"+'Initial Settings'!$C$7","v":2015},{"$f":"+'Owner-Operator Inputs'!F254","v":2016},{"$f":"+'Owner-Operator Inputs'!G254","v":2017},{"$f":"+'Owner-Operator Inputs'!H254","v":2018},{"$f":"+'Owner-Operator Inputs'!I254","v":2019},{"$f":"+'Owner-Operator Inputs'!J254","v":2020},{"$f":"+'Owner-Operator Inputs'!K254","v":2021},{"$f":"+'Owner-Operator Inputs'!L254","v":2022},{"$f":"+'Owner-Operator Inputs'!M254","v":2023},{"$f":"+'Owner-Operator Inputs'!N254","v":2024},{"$f":"+'Owner-Operator Inputs'!O254","v":2025}]
["Current assets"]
{"$rows_left_out":34}
{"sheet":"SCF","index":15,"n_rows":30,"n_cols":15,"rows_kept":30,"cut":false,"hidden":false,"merged":[]}
[{"$f":"'Initial Settings'!$C$6","v":"Washington EV - Business Model 3 - Walla Walla"}]
[]
["Consolidated Statement of Cash Flows [$]"]
[]
[null,null,null,null,null,{"$f":"'Owner-Operator Inputs'!F254","v":2016},{"$f":"'Owner-Operator Inputs'!G254","v":2017},{"$f":"'Owner-Operator Inputs'!H254","v":2018},{"$f":"'Owner-Operator Inputs'!I254","v":2019},{"$f":"'Owner-Operator Inputs'!J254","v":2020},{"$f":"'Owner-Operator Inputs'!K254","v":2021},{"$f":"'Owner-Operator Inputs'!L254","v":2022},{"$f":"'Owner-Operator Inputs'!M254","v":2023},{"$f":"'Owner-Operator Inputs'!N254","v":2024},{"$f":"'Owner-Operator Inputs'!O254","v":2025}]
["Cash Flow from Operations"]
{"$rows_left_out":25}
{"sheet":"Report","index":16,"n_rows":31,"n_cols":3,"rows_kept":31,"cut":false,"hidden":true,"merged":[[13,0,13,1],[20,0,20,1],[14,0,14,1],[15,0,15,1],[16,0,16,2],[17,0,17,1],[18,0,18,1],[19,0,19,1],[12,0,12,1],[0,0,0,1],[1,0,1,2],[2,0,2,1],[3,0,3,1],[4,0,4,1],[5,0,5,2],[6,0,6,1],[7,0,8,0],[9,0,9,1],[10,0,10,1],[11,0,11,2]]}
["Financial Metric",null,"Result"]
["Total project level perspective"]
["Total capital investment (spent on charging station deployment)",null,{"$f":"'Outputs Dashboard'!C5","v":1384100}]
["NPV",null,{"$f":"IF('Outputs Dashboard'!C6>0, \"+\" & TEXT('Outputs Dashboard'!C6, \"$#,##0\"), TEXT('Outputs Dashboard'!C6, \"$#,##0\"))","v":"+$862,640"}]
["Payback period",null,{"$f":"IF('Outputs Dashboard'!C8=\"N/A\", \"No payback\", 'Outputs Dashboard'!C8 & \" years\")","v":"6 years"}]
["Owner operator perspective"]
{"$rows_left_out":26}
{"sheet":"Sensitivity Tables","index":17,"n_rows":224,"n_cols":9,"rows_kept":224,"cut":false,"hidden":false,"merged":[[74,1,74,8],[75,1,75,4],[160,1,160,4],[160,5,160,8],[143,5,143,8],[143,1,143,4],[142,1,142,8],[159,1,159,8],[109,1,109,4],[109,5,109,8],[125,1,125,8],[126,1,126,4],[126,5,126,8],[75,5,75,8],[91,1,91,8],[92,1,92,4],[40,1,40,8],[41,1,41,4],[41,5,41,8],[57,1,57,8],[58,1,58,4],[58,5,58,8],[24,1,24,4],[24,5,24,8],[2,0,2,6],[6,1,6,8],[23,1,23,8],[7,1,7,4],[7,5,7,8],[92,5,92,8],[108,1,108,8],[210,1,210,8],[211,1,211,4],[211,5,211,8],[176,1,176,8],[177,1,177,4],[177,5,177,8],[193,1,193,8],[194,1,194,4],[194,5,194,8]]}
[{"$f":"'Initial Settings'!C6","v":"Washington EV - Business Model 3 - Walla Walla"}]
[]
["Sensitivity Tables"]
[]
["Sensitivity Analysis #1"]
[]
{"$rows_left_out":219}
{"sheet":"Lists_Hidden","index":18,"n_rows":7,"n_cols":1,"rows_kept":7,"cut":false,"hidden":true,"merged":[[2,0,2,6]]}
[{"$f":"'Initial Settings'!C6","v":"Washington EV - Business Model 3 - Walla Walla"}]
[]
["Lists"]
[]
["Yes/No List"]
["Y"]
{"$rows_left_out":2}
{"sheet":"Version","index":19,"n_rows":12,"n_cols":2,"rows_kept":12,"cut":false,"hidden":false,"merged":[]}
["Version","Revisions"]
["1.0","First launch"]
["1.1","Added cumulative NPV and new discounted payback calculations (removed old average payback based on IRR)\nFixed #N/As on sensitivity charts\nAdded other contributions to outputs tab"]
["1.5","• Streamlined the sensitivity analysis. Put the tables on a separate tab. Redid table formats\n• Rewired the sensitivity analysis so that it pulls inputs from the input tabs, not the other way around.\n• Major overhaul to more accurately reflect equipment lives other than 10 years. Examples:\no Owner operator income streams now stop if equipment depreciates faster than 10 years\no Terminal value function has been redone to consider equipment value if there is remaining equipment life at the end of the 10-year DCF\n• Consolidated some variables like equipment life, revenue per hour, etc. so that one variable feeds into all three station types. This removes some granularity of control, but makes sensitivity analysis easier.\n• Reversed the flow of the equation on the “Private Sector” tabs to derive revenue from NPV value instead of an NPV value from revenue (as requested by C2ES) \n• Moved sensitivity charts off output tab. Added additional charts.\n"]
["1.6","Revised revenue sharing formulas"]
[null,"Add capped (semi-subordinated) public equity option (functions like a loan that is repaid only if funds are available)\nAdd blended discount rate for the project"]
{"$rows_left_out":6}